Target
Serine/threonine-protein phosphatase PP1-alpha catalytic subunit
Ligand
BDBM64783
Substrate
Meas. Tech.
Counterscreen for inhibitors of PP5: fluorescence-based biochemical high throughput dose response assay for inhibitors of Protein Phosphatase 1 (PP1)
IC50
67047±n/a nM
Citation
 PubChem, PC Counterscreen for inhibitors of PP5: fluorescence-based biochemical high throughput dose response assay for inhibitors of Protein Phosphatase 1 (PP1) PubChem Bioassay (2010)[AID] 
Target
Name:
Serine/threonine-protein phosphatase PP1-alpha catalytic subunit
Synonyms:
PP-1A PPP1A Serine/threonine protein phosphatase PP1-alpha catalytic subunit protein phosphatase 1, catalytic subunit, alpha isoform 3
Type:
PROTEIN
Mol. Mass.:
37510.66
Organism:
Homo sapiens (Human)
Description:
ChEMBL_197827
Residue:
330
  
Inhibitor
Name:
BDBM64783
Synonyms:
1-(2,1,3-benzothiadiazol-5-yl)-3-(4-ethoxyphenyl)thiourea MLS000576242 SMR000197073 | cid_804043
Type:
Small organic molecule
Emp. Form.:
C15H14N4OS2
Mol. Mass.:
330.428
SMILES:
CCOc1ccc(NC(=S)Nc2ccc3nsnc3c2)cc1
: