Target
Serine/threonine-protein phosphatase PP1-alpha catalytic subunit
Ligand
BDBM34182
Substrate
Meas. Tech.
Counterscreen for inhibitors of PP5: fluorescence-based biochemical high throughput dose response assay for inhibitors of Protein Phosphatase 1 (PP1)
IC50
67047±n/a nM
Citation
 PubChem, PC Counterscreen for inhibitors of PP5: fluorescence-based biochemical high throughput dose response assay for inhibitors of Protein Phosphatase 1 (PP1) PubChem Bioassay (2010)[AID] 
Target
Name:
Serine/threonine-protein phosphatase PP1-alpha catalytic subunit
Synonyms:
PP-1A PPP1A Serine/threonine protein phosphatase PP1-alpha catalytic subunit protein phosphatase 1, catalytic subunit, alpha isoform 3
Type:
PROTEIN
Mol. Mass.:
37510.66
Organism:
Homo sapiens (Human)
Description:
ChEMBL_197827
Residue:
330
  
Inhibitor
Name:
BDBM34182
Synonyms:
3-anilino-2H-isoquinolin-1-one 3-anilinoisoquinolin-1(2H)-one MLS000043701 cid_2142225
Type:
Small organic molecule
Emp. Form.:
C15H12N2O
Mol. Mass.:
236.2686
SMILES:
O=c1[nH]c(Nc2ccccc2)cc2ccccc12
: