Target
Serine/threonine-protein phosphatase
Ligand
BDBM64777
Substrate
Meas. Tech.
Fluorescence-based biochemical high throughput dose response assay for inhibitors of Protein Phosphatase 5 (PP5)
IC50
15180±n/a nM
Citation
 PubChem, PC Fluorescence-based biochemical high throughput dose response assay for inhibitors of Protein Phosphatase 5 (PP5) PubChem Bioassay (2010)[AID] 
Target
Name:
Serine/threonine-protein phosphatase
Synonyms:
H0YDU8_HUMAN PPP5C protein
Type:
Enzyme Catalytic Domain
Mol. Mass.:
55092.68
Organism:
Homo sapiens (Human)
Description:
gi_37589898
Residue:
484
  
Inhibitor
Name:
BDBM64777
Synonyms:
1,8-bis(azanyl)-3-[butyl(ethyl)amino]-6-ethoxy-2,7-naphthyridine-4-carbonitrile MLS000564759 cid_5216640
Type:
Small organic molecule
Emp. Form.:
C17H24N6O
Mol. Mass.:
328.4121
SMILES:
CCCCN(CC)c1nc(N)c2c(N)nc(OCC)cc2c1C#N
: