Target
Serine/threonine-protein phosphatase
Ligand
BDBM64788
Substrate
Meas. Tech.
Fluorescence-based biochemical high throughput dose response assay for inhibitors of Protein Phosphatase 5 (PP5)
IC50
9572±n/a nM
Citation
 PubChem, PC Fluorescence-based biochemical high throughput dose response assay for inhibitors of Protein Phosphatase 5 (PP5) PubChem Bioassay (2010)[AID] 
Target
Name:
Serine/threonine-protein phosphatase
Synonyms:
H0YDU8_HUMAN PPP5C protein
Type:
Enzyme Catalytic Domain
Mol. Mass.:
55092.68
Organism:
Homo sapiens (Human)
Description:
gi_37589898
Residue:
484
  
Inhibitor
Name:
BDBM64788
Synonyms:
4-[(5-keto-3-methyl-1-phenyl-3-pyrazolin-4-yl)-(4-nitrophenyl)methyl]-5-methyl-2-phenyl-3-pyrazolin-3-one 5-methyl-4-[(5-methyl-3-oxo-2-phenyl-1H-pyrazol-4-yl)-(4-nitrophenyl)methyl]-2-phenyl-1H-pyrazol-3-one SMR000218378 | cid_2251550
Type:
Small organic molecule
Emp. Form.:
C27H23N5O4
Mol. Mass.:
481.5026
SMILES:
Cc1[nH]n(-c2ccccc2)c(=O)c1C(c1c(C)[nH]n(-c2ccccc2)c1=O)c1ccc(cc1)[N+]([O-])=O
: