Target
Serine/threonine-protein phosphatase
Ligand
BDBM43838
Substrate
Meas. Tech.
Fluorescence-based biochemical high throughput dose response assay for inhibitors of Protein Phosphatase 5 (PP5)
IC50
8955±n/a nM
Citation
 PubChem, PC Fluorescence-based biochemical high throughput dose response assay for inhibitors of Protein Phosphatase 5 (PP5) PubChem Bioassay (2010)[AID] 
Target
Name:
Serine/threonine-protein phosphatase
Synonyms:
H0YDU8_HUMAN PPP5C protein
Type:
Enzyme Catalytic Domain
Mol. Mass.:
55092.68
Organism:
Homo sapiens (Human)
Description:
gi_37589898
Residue:
484
  
Inhibitor
Name:
BDBM43838
Synonyms:
4-O-[5-bromo-2-cyclopropyl-3-(4-methoxyphenyl)-7-methyl-6,8-dioxoisoquinolin-7-yl] 1-O-methyl butanedioate Glucosamine derivative, 11 O4-[5-bromanyl-2-cyclopropyl-3-(4-methoxyphenyl)-7-methyl-6,8-bis(oxidanylidene)isoquinolin-7-yl] O1-methyl butanedioate butanedioic acid O4-[5-bromo-2-cyclopropyl-3-(4-methoxyphenyl)-7-methyl-6,8-dioxo-7-isoquinolinyl] ester O1-methyl ester succinic acid O4-[5-bromo-2-cyclopropyl-6,8-diketo-3-(4-methoxyphenyl)-7-methyl-7-isoquinolyl] ester O1-methyl ester
Type:
Small organic molecule
Emp. Form.:
C25H24BrNO7
Mol. Mass.:
530.365
SMILES:
COC(=O)CCC(=O)OC1(C)C(=O)C(Br)=C2C=C(N(C=C2C1=O)C1CC1)c1ccc(OC)cc1
: