Target
Serine/threonine-protein phosphatase
Ligand
BDBM61232
Substrate
Meas. Tech.
Fluorescence-based biochemical high throughput dose response assay for inhibitors of Protein Phosphatase 5 (PP5)
IC50
5924±n/a nM
Citation
 PubChem, PC Fluorescence-based biochemical high throughput dose response assay for inhibitors of Protein Phosphatase 5 (PP5) PubChem Bioassay (2010)[AID] 
Target
Name:
Serine/threonine-protein phosphatase
Synonyms:
H0YDU8_HUMAN PPP5C protein
Type:
Enzyme Catalytic Domain
Mol. Mass.:
55092.68
Organism:
Homo sapiens (Human)
Description:
gi_37589898
Residue:
484
  
Inhibitor
Name:
BDBM61232
Synonyms:
(2-bromanyl-4,5-dimethoxy-phenyl)-(6,7-dimethoxyisoquinolin-1-yl)methanone (2-bromo-4,5-dimethoxyphenyl)(6,7-dimethoxy-1-isoquinolinyl)methanone (2-bromo-4,5-dimethoxyphenyl)-(6,7-dimethoxyisoquinolin-1-yl)methanone SMR000498332 | cid_2974206
Type:
Small organic molecule
Emp. Form.:
C20H18BrNO5
Mol. Mass.:
432.265
SMILES:
COc1cc(Br)c(cc1OC)C(=O)c1nccc2cc(OC)c(OC)cc12
: