Target
Serine/threonine-protein phosphatase
Ligand
BDBM48030
Substrate
Meas. Tech.
Fluorescence-based biochemical high throughput dose response assay for inhibitors of Protein Phosphatase 5 (PP5)
IC50
67047±n/a nM
Citation
 PubChem, PC Fluorescence-based biochemical high throughput dose response assay for inhibitors of Protein Phosphatase 5 (PP5) PubChem Bioassay (2010)[AID] 
Target
Name:
Serine/threonine-protein phosphatase
Synonyms:
H0YDU8_HUMAN PPP5C protein
Type:
Enzyme Catalytic Domain
Mol. Mass.:
55092.68
Organism:
Homo sapiens (Human)
Description:
gi_37589898
Residue:
484
  
Inhibitor
Name:
BDBM48030
Synonyms:
4-[(E)-[3-(2-fluoroanilino)-4-keto-1-naphthylidene]amino]sulfonylbenzoic acid 4-[(E)-[3-(2-fluoroanilino)-4-oxonaphthalen-1-ylidene]amino]sulfonylbenzoic acid MLS000948172 cid_6023694
Type:
Small organic molecule
Emp. Form.:
C23H15FN2O5S
Mol. Mass.:
450.439
SMILES:
OC(=O)c1ccc(cc1)S(=O)(=O)N=C1C=C(Nc2ccccc2F)C(=O)c2ccccc12
: