Target
G-protein coupled receptor 55
Ligand
BDBM64803
Substrate
Meas. Tech.
SAR Analysis of Selective Antagonists of GPR55 using an Image-Based Assay
IC50
>32000±n/a nM
Citation
 PubChem, PC SAR Analysis of Selective Antagonists of GPR55 using an Image-Based Assay PubChem Bioassay (2010)[AID] 
Target
Name:
G-protein coupled receptor 55
Synonyms:
G protein-coupled receptor 55 GPR55_HUMAN
Type:
PROTEIN
Mol. Mass.:
36649.72
Organism:
Homo sapiens (Human)
Description:
ChEMBL_1292265
Residue:
319
  
Inhibitor
Name:
BDBM64803
Synonyms:
2-bromanyl-N-[2-[(3,4-dichlorophenyl)methylsulfanyl]-1,3-benzothiazol-6-yl]benzamide 2-bromo-N-[2-[(3,4-dichlorophenyl)methylsulfanyl]-1,3-benzothiazol-6-yl]benzamide MLS-0435409.0001 | cid_1814673
Type:
Small organic molecule
Emp. Form.:
C21H13BrCl2N2OS2
Mol. Mass.:
524.281
SMILES:
Clc1ccc(CSc2nc3ccc(NC(=O)c4ccccc4Br)cc3s2)cc1Cl
: