Target
G-protein coupled receptor 55
Ligand
BDBM64805
Substrate
Meas. Tech.
SAR Analysis of Selective Antagonists of GPR55 using an Image-Based Assay
IC50
>32000±n/a nM
Citation
 PubChem, PC SAR Analysis of Selective Antagonists of GPR55 using an Image-Based Assay PubChem Bioassay (2010)[AID] 
Target
Name:
G-protein coupled receptor 55
Synonyms:
G protein-coupled receptor 55 GPR55_HUMAN
Type:
PROTEIN
Mol. Mass.:
36649.72
Organism:
Homo sapiens (Human)
Description:
ChEMBL_1292265
Residue:
319
  
Inhibitor
Name:
BDBM64805
Synonyms:
2-(4-methoxyphenyl)-5-(3-pyridinyl)-1,3,4-oxadiazole 2-(4-methoxyphenyl)-5-pyridin-3-yl-1,3,4-oxadiazole cid_865615
Type:
Small organic molecule
Emp. Form.:
C14H11N3O2
Mol. Mass.:
253.256
SMILES:
COc1ccc(cc1)-c1nnc(o1)-c1cccnc1
: