Target
G-protein coupled receptor 55
Ligand
BDBM64816
Substrate
Meas. Tech.
SAR Analysis of Selective Antagonists of GPR55 using an Image-Based Assay
IC50
>32000±n/a nM
Citation
 PubChem, PC SAR Analysis of Selective Antagonists of GPR55 using an Image-Based Assay PubChem Bioassay (2010)[AID] 
Target
Name:
G-protein coupled receptor 55
Synonyms:
G protein-coupled receptor 55 GPR55_HUMAN
Type:
PROTEIN
Mol. Mass.:
36649.72
Organism:
Homo sapiens (Human)
Description:
ChEMBL_1292265
Residue:
319
  
Inhibitor
Name:
BDBM64816
Synonyms:
4-[[2-[2-(4-ethoxyanilino)-2-oxoethyl]sulfanyl-4-oxothieno[3,2-d]pyrimidin-3-yl]methyl]benzoic acid 4-[[2-[[2-(4-ethoxyanilino)-2-oxoethyl]thio]-4-oxo-3-thieno[3,2-d]pyrimidinyl]methyl]benzoic acid MLS-0435426.0001 | cid_4362054
Type:
Small organic molecule
Emp. Form.:
C24H21N3O5S2
Mol. Mass.:
495.571
SMILES:
CCOc1ccc(NC(=O)CSc2nc3ccsc3c(=O)n2Cc2ccc(cc2)C(O)=O)cc1
: