Target
G-protein coupled receptor 55
Ligand
BDBM61647
Substrate
Meas. Tech.
SAR Analysis of Selective Antagonists of GPR55 using an Image-Based Assay
IC50
>32000±n/a nM
Citation
 PubChem, PC SAR Analysis of Selective Antagonists of GPR55 using an Image-Based Assay PubChem Bioassay (2010)[AID] 
Target
Name:
G-protein coupled receptor 55
Synonyms:
G protein-coupled receptor 55 GPR55_HUMAN
Type:
PROTEIN
Mol. Mass.:
36649.72
Organism:
Homo sapiens (Human)
Description:
ChEMBL_1292265
Residue:
319
  
Inhibitor
Name:
BDBM61647
Synonyms:
MLS001030592 N-(2,3-dihydro-1,4-benzodioxin-6-yl)-2,5-dimethyl-4-(4-methylpiperidin-1-yl)thieno[2,3-d]pyrimidine-6-carboxamide SMR000635352 | cid_4137407
Type:
Small organic molecule
Emp. Form.:
C23H26N4O3S
Mol. Mass.:
438.543
SMILES:
CC1CCN(CC1)c1nc(C)nc2sc(C(=O)Nc3ccc4OCCOc4c3)c(C)c12
: