Target
G-protein coupled receptor 55
Ligand
BDBM64832
Substrate
Meas. Tech.
SAR Analysis of Selective Antagonists of GPR55 using an Image-Based Assay
IC50
>32000±n/a nM
Citation
 PubChem, PC SAR Analysis of Selective Antagonists of GPR55 using an Image-Based Assay PubChem Bioassay (2010)[AID] 
Target
Name:
G-protein coupled receptor 55
Synonyms:
G protein-coupled receptor 55 GPR55_HUMAN
Type:
PROTEIN
Mol. Mass.:
36649.72
Organism:
Homo sapiens (Human)
Description:
ChEMBL_1292265
Residue:
319
  
Inhibitor
Name:
BDBM64832
Synonyms:
3-(2-methylphenoxy)-N-[2-(4-sulfamoylphenyl)ethyl]propanamide MLS-0213188.0001 | cid_5031770
Type:
Small organic molecule
Emp. Form.:
C18H22N2O4S
Mol. Mass.:
362.443
SMILES:
Cc1ccccc1OCCC(=O)NCCc1ccc(cc1)S(N)(=O)=O
: