Target
Mu-type opioid receptor
Ligand
BDBM54768
Substrate
Meas. Tech.
Fluorescence-based biochemical high throughput dose response assay to identify inhibitors of Protein Phosphatase 1 (PP1)
IC50
2463±n/a nM
Citation
 PubChem, PC Fluorescence-based biochemical high throughput dose response assay to identify inhibitors of Protein Phosphatase 1 (PP1) PubChem Bioassay (2010)[AID] 
Target
Name:
Mu-type opioid receptor
Synonyms:
M-OR-1 MOR-1 MUOR1 Mu opiate receptor OPRM1 hMOP | mu-type opioid receptor isoform MOR-1
Type:
G Protein-Coupled Receptor (GPCR)
Mol. Mass.:
44789.51
Organism:
Homo sapiens (Human)
Description:
P35372
Residue:
400
  
Inhibitor
Name:
BDBM54768
Synonyms:
2-[3-[2-hydroxyethyl(dimethyl)ammonio]propanoylamino]-2-methyl-propane-1-sulfonate 2-[3-[2-hydroxyethyl(dimethyl)azaniumyl]propanoylamino]-2-methylpropane-1-sulfonate MLS000554255 US20230364057, Compound 42 | cid_1973720
Type:
Small organic molecule
Emp. Form.:
C11H24N2O5S
Mol. Mass.:
296.384
SMILES:
CC(C)(CS([O-])(=O)=O)NC(=O)CC[N+](C)(C)CCO
: