Target
Mu-type opioid receptor
Ligand
BDBM64846
Substrate
Meas. Tech.
Fluorescence-based biochemical high throughput dose response assay to identify inhibitors of Protein Phosphatase 1 (PP1)
IC50
8457±n/a nM
Citation
 PubChem, PC Fluorescence-based biochemical high throughput dose response assay to identify inhibitors of Protein Phosphatase 1 (PP1) PubChem Bioassay (2010)[AID] 
Target
Name:
Mu-type opioid receptor
Synonyms:
M-OR-1 MOR-1 MUOR1 Mu opiate receptor OPRM1 hMOP | mu-type opioid receptor isoform MOR-1
Type:
G Protein-Coupled Receptor (GPCR)
Mol. Mass.:
44789.51
Organism:
Homo sapiens (Human)
Description:
P35372
Residue:
400
  
Inhibitor
Name:
BDBM64846
Synonyms:
4-(3-chloranylphenoxy)-5-methoxy-2-pyridin-2-yl-pyrimidine 4-(3-chlorophenoxy)-5-methoxy-2-(2-pyridyl)pyrimidine MLS000325831 cid_3722206
Type:
Small organic molecule
Emp. Form.:
C16H12ClN3O2
Mol. Mass.:
313.738
SMILES:
COc1cnc(nc1Oc1cccc(Cl)c1)-c1ccccn1
: