Target
Mu-type opioid receptor
Ligand
BDBM57567
Substrate
Meas. Tech.
Fluorescence-based biochemical high throughput dose response assay to identify inhibitors of Protein Phosphatase 1 (PP1)
IC50
6675±n/a nM
Citation
 PubChem, PC Fluorescence-based biochemical high throughput dose response assay to identify inhibitors of Protein Phosphatase 1 (PP1) PubChem Bioassay (2010)[AID] 
Target
Name:
Mu-type opioid receptor
Synonyms:
M-OR-1 MOR-1 MUOR1 Mu opiate receptor OPRM1 hMOP | mu-type opioid receptor isoform MOR-1
Type:
G Protein-Coupled Receptor (GPCR)
Mol. Mass.:
44789.51
Organism:
Homo sapiens (Human)
Description:
P35372
Residue:
400
  
Inhibitor
Name:
BDBM57567
Synonyms:
MLS000589396 N-[(2,4-dimethoxyphenyl)methylideneamino]-2-(3,5-dimethylpyrazol-1-yl)-6-methyl-pyrimidin-4-amine N-[1-(2,4-Dimethoxy-phenyl)-meth-(E)-ylidene]-N'-[2-(3,5-dimethyl-pyrazol-1-yl)-6-methyl-pyrimidin-4-yl]-hydrazine [(2,4-dimethoxybenzylidene)amino]-[2-(3,5-dimethylpyrazol-1-yl)-6-methyl-pyrimidin-4-yl]amine | cid_5110992
Type:
Small organic molecule
Emp. Form.:
C19H22N6O2
Mol. Mass.:
366.417
SMILES:
COc1ccc(CN=Nc2cc(C)nc(n2)-n2nc(C)cc2C)c(OC)c1
: