Target
Mu-type opioid receptor
Ligand
BDBM64850
Substrate
Meas. Tech.
Fluorescence-based biochemical high throughput dose response assay to identify inhibitors of Protein Phosphatase 1 (PP1)
IC50
11091±n/a nM
Citation
 PubChem, PC Fluorescence-based biochemical high throughput dose response assay to identify inhibitors of Protein Phosphatase 1 (PP1) PubChem Bioassay (2010)[AID] 
Target
Name:
Mu-type opioid receptor
Synonyms:
M-OR-1 MOR-1 MUOR1 Mu opiate receptor OPRM1 hMOP | mu-type opioid receptor isoform MOR-1
Type:
G Protein-Coupled Receptor (GPCR)
Mol. Mass.:
44789.51
Organism:
Homo sapiens (Human)
Description:
P35372
Residue:
400
  
Inhibitor
Name:
BDBM64850
Synonyms:
5,6-bis(azanyl)-3-[(4-methoxyphenyl)methyl]-2-oxidanylidene-8-piperidin-1-yl-1H-pyrrolo[2,3-c][2,7]naphthyridine-9-carbonitrile 5,6-diamino-3-[(4-methoxyphenyl)methyl]-2-oxo-8-(1-piperidinyl)-1H-pyrrolo[2,3-c][2,7]naphthyridine-9-carbonitrile MLS000391116 cid_5158786
Type:
Small organic molecule
Emp. Form.:
C24H25N7O2
Mol. Mass.:
443.501
SMILES:
COc1ccc(CN2C(=O)Cc3c2nc(N)c2c(N)nc(N4CCCCC4)c(C#N)c32)cc1
: