Target
Mu-type opioid receptor
Ligand
BDBM64860
Substrate
Meas. Tech.
Fluorescence-based biochemical high throughput dose response assay to identify inhibitors of Protein Phosphatase 1 (PP1)
IC50
9647±n/a nM
Citation
 PubChem, PC Fluorescence-based biochemical high throughput dose response assay to identify inhibitors of Protein Phosphatase 1 (PP1) PubChem Bioassay (2010)[AID] 
Target
Name:
Mu-type opioid receptor
Synonyms:
M-OR-1 MOR-1 MUOR1 Mu opiate receptor OPRM1 hMOP | mu-type opioid receptor isoform MOR-1
Type:
G Protein-Coupled Receptor (GPCR)
Mol. Mass.:
44789.51
Organism:
Homo sapiens (Human)
Description:
P35372
Residue:
400
  
Inhibitor
Name:
BDBM64860
Synonyms:
5-(4-chlorophenyl)-1-(4-methylphenyl)-1H-pyrazole-3-carboxylic acid 5-(4-chlorophenyl)-1-(4-methylphenyl)pyrazole-3-carboxylic acid MLS000755192 cid_1477242
Type:
Small organic molecule
Emp. Form.:
C17H13ClN2O2
Mol. Mass.:
312.75
SMILES:
Cc1ccc(cc1)-n1nc(cc1-c1ccc(Cl)cc1)C(O)=O
: