Target
Mu-type opioid receptor
Ligand
BDBM58005
Substrate
Meas. Tech.
Fluorescence-based biochemical high throughput dose response assay to identify inhibitors of Protein Phosphatase 1 (PP1)
IC50
4592±n/a nM
Citation
 PubChem, PC Fluorescence-based biochemical high throughput dose response assay to identify inhibitors of Protein Phosphatase 1 (PP1) PubChem Bioassay (2010)[AID] 
Target
Name:
Mu-type opioid receptor
Synonyms:
M-OR-1 MOR-1 MUOR1 Mu opiate receptor OPRM1 hMOP | mu-type opioid receptor isoform MOR-1
Type:
G Protein-Coupled Receptor (GPCR)
Mol. Mass.:
44789.51
Organism:
Homo sapiens (Human)
Description:
P35372
Residue:
400
  
Inhibitor
Name:
BDBM58005
Synonyms:
4-(4-methoxyphenoxy)-N-(4-pyridin-2-yl-1,3-thiazol-2-yl)butanamide 4-(4-methoxyphenoxy)-N-[4-(2-pyridyl)thiazol-2-yl]butyramide SMR000376152 | cid_2578872
Type:
Small organic molecule
Emp. Form.:
C19H19N3O3S
Mol. Mass.:
369.437
SMILES:
COc1ccc(OCCCC(=O)Nc2nc(cs2)-c2ccccn2)cc1
: