Target
Mu-type opioid receptor
Ligand
BDBM54151
Substrate
Meas. Tech.
Fluorescence-based biochemical high throughput dose response assay to identify inhibitors of Protein Phosphatase 1 (PP1)
IC50
227.35±n/a nM
Citation
 PubChem, PC Fluorescence-based biochemical high throughput dose response assay to identify inhibitors of Protein Phosphatase 1 (PP1) PubChem Bioassay (2010)[AID] 
Target
Name:
Mu-type opioid receptor
Synonyms:
M-OR-1 MOR-1 MUOR1 Mu opiate receptor OPRM1 hMOP | mu-type opioid receptor isoform MOR-1
Type:
G Protein-Coupled Receptor (GPCR)
Mol. Mass.:
44789.51
Organism:
Homo sapiens (Human)
Description:
P35372
Residue:
400
  
Inhibitor
Name:
BDBM54151
Synonyms:
(2S)-2-[[(2S)-2-[[(2S)-2-[[(2S,3S)-3-amino-2-hydroxy-1-oxodecyl]-methylamino]-4-methylsulfinyl-1-oxobutyl]amino]-3-(4-hydroxyphenyl)-1-oxopropyl]amino]-3-(4-hydroxyphenyl)propanoic acid (2S)-2-[[(2S)-2-[[(2S)-2-[[(2S,3S)-3-amino-2-hydroxydecanoyl]-methylamino]-4-methylsulfinylbutanoyl]amino]-3-(4-hydroxyphenyl)propanoyl]amino]-3-(4-hydroxyphenyl)propanoic acid MLS000728323 cid_16746541 | microginin 690 revised
Type:
Small organic molecule
Emp. Form.:
C34H50N4O9S
Mol. Mass.:
690.847
SMILES:
CCCCCCC[C@H](N)[C@H](O)C(=O)N(C)[C@@H](CCS(C)=O)C(=O)N[C@@H](Cc1ccc(O)cc1)C(=O)N[C@@H](Cc1ccc(O)cc1)C(O)=O
: