Target
Mu-type opioid receptor
Ligand
BDBM62187
Substrate
Meas. Tech.
SAR Analysis of Antagonists of the MOR Receptor using an Image-Based Assay
IC50
>32000±n/a nM
Citation
 PubChem, PC SAR Analysis of Antagonists of the MOR Receptor using an Image-Based Assay PubChem Bioassay (2010)[AID] 
Target
Name:
Mu-type opioid receptor
Synonyms:
M-OR-1 MOR-1 MUOR1 Mu opiate receptor OPRM1 hMOP | mu-type opioid receptor isoform MOR-1
Type:
G Protein-Coupled Receptor (GPCR)
Mol. Mass.:
44789.51
Organism:
Homo sapiens (Human)
Description:
P35372
Residue:
400
  
Inhibitor
Name:
BDBM62187
Synonyms:
(phenylmethyl) N-[2,2,2-tris(chloranyl)-1-[(2,4-dimethylphenyl)carbamothioylamino]ethyl]carbamate N-[2,2,2-trichloro-1-[(2,4-dimethylphenyl)thiocarbamoylamino]ethyl]carbamic acid benzyl ester benzyl N-[2,2,2-trichloro-1-[(2,4-dimethylphenyl)carbamothioylamino]ethyl]carbamate | cid_3091259
Type:
Small organic molecule
Emp. Form.:
C19H20Cl3N3O2S
Mol. Mass.:
460.805
SMILES:
Cc1ccc(NC(=S)NC(NC(=O)OCc2ccccc2)C(Cl)(Cl)Cl)c(C)c1
: