Target
Mu-type opioid receptor
Ligand
BDBM54783
Substrate
Meas. Tech.
SAR Analysis of Antagonists of the MOR Receptor using an Image-Based Assay
IC50
>32000±n/a nM
Citation
 PubChem, PC SAR Analysis of Antagonists of the MOR Receptor using an Image-Based Assay PubChem Bioassay (2010)[AID] 
Target
Name:
Mu-type opioid receptor
Synonyms:
M-OR-1 MOR-1 MUOR1 Mu opiate receptor OPRM1 hMOP | mu-type opioid receptor isoform MOR-1
Type:
G Protein-Coupled Receptor (GPCR)
Mol. Mass.:
44789.51
Organism:
Homo sapiens (Human)
Description:
P35372
Residue:
400
  
Inhibitor
Name:
BDBM54783
Synonyms:
MLS000551700 N-butyl-N-[(2-oxidanylidene-1H-quinolin-3-yl)methyl]pyridine-2-carboxamide N-butyl-N-[(2-oxo-1H-quinolin-3-yl)methyl]pyridine-2-carboxamide SMR000145625 | cid_4376926
Type:
Small organic molecule
Emp. Form.:
C20H21N3O2
Mol. Mass.:
335.3996
SMILES:
CCCCN(Cc1cc2ccccc2[nH]c1=O)C(=O)c1ccccn1
: