Target
Trans-activator protein BZLF1
Ligand
BDBM56924
Substrate
Meas. Tech.
Counterscreen for inhibitors of PP1: fluorescence-based biochemical high throughput dose response assay to identify inhibitors of Protein Phosphatase 5 (PP5)
IC50
>67047±n/a nM
Citation
 PubChem, PC Counterscreen for inhibitors of PP1: fluorescence-based biochemical high throughput dose response assay to identify inhibitors of Protein Phosphatase 5 (PP5) PubChem Bioassay (2010)[AID] 
Target
Name:
Trans-activator protein BZLF1
Synonyms:
BZLF1 PPP5C protein
Type:
Enzyme Catalytic Domain
Mol. Mass.:
26856.37
Organism:
Human herpesvirus 4
Description:
gi_82503229
Residue:
245
  
Inhibitor
Name:
BDBM56924
Synonyms:
2-(3,5-dimethyl-1-pyrazolyl)-4-[(phenylmethyl)amino]-5-pyrimidinecarboxylic acid ethyl ester MLS000040639 cid_662954 ethyl 4-(benzylamino)-2-(3,5-dimethylpyrazol-1-yl)pyrimidine-5-carboxylate
Type:
Small organic molecule
Emp. Form.:
C19H21N5O2
Mol. Mass.:
351.4023
SMILES:
CCOC(=O)c1cnc(nc1NCc1ccccc1)-n1nc(C)cc1C
: