Target
Trans-activator protein BZLF1
Ligand
BDBM64857
Substrate
Meas. Tech.
Counterscreen for inhibitors of PP1: fluorescence-based biochemical high throughput dose response assay to identify inhibitors of Protein Phosphatase 5 (PP5)
IC50
>67047±n/a nM
Citation
 PubChem, PC Counterscreen for inhibitors of PP1: fluorescence-based biochemical high throughput dose response assay to identify inhibitors of Protein Phosphatase 5 (PP5) PubChem Bioassay (2010)[AID] 
Target
Name:
Trans-activator protein BZLF1
Synonyms:
BZLF1 PPP5C protein
Type:
Enzyme Catalytic Domain
Mol. Mass.:
26856.37
Organism:
Human herpesvirus 4
Description:
gi_82503229
Residue:
245
  
Inhibitor
Name:
BDBM64857
Synonyms:
5-methoxy-4-(4-methylphenyl)sulfanyl-2-pyridin-2-yl-pyrimidine 5-methoxy-4-(p-tolylthio)-2-(2-pyridyl)pyrimidine MLS000692232 cid_1470825 | methyl 4-[(4-methylphenyl)sulfanyl]-2-(2-pyridinyl)-5-pyrimidinyl ether
Type:
Small organic molecule
Emp. Form.:
C17H15N3OS
Mol. Mass.:
309.386
SMILES:
COc1cnc(nc1Sc1ccc(C)cc1)-c1ccccn1
: