Target
Trans-activator protein BZLF1
Ligand
BDBM55814
Substrate
Meas. Tech.
Counterscreen for inhibitors of PP1: fluorescence-based biochemical high throughput dose response assay to identify inhibitors of Protein Phosphatase 5 (PP5)
IC50
>67047±n/a nM
Citation
 PubChem, PC Counterscreen for inhibitors of PP1: fluorescence-based biochemical high throughput dose response assay to identify inhibitors of Protein Phosphatase 5 (PP5) PubChem Bioassay (2010)[AID] 
Target
Name:
Trans-activator protein BZLF1
Synonyms:
BZLF1 PPP5C protein
Type:
Enzyme Catalytic Domain
Mol. Mass.:
26856.37
Organism:
Human herpesvirus 4
Description:
gi_82503229
Residue:
245
  
Inhibitor
Name:
BDBM55814
Synonyms:
5-[[5-(2,5-dichlorophenyl)-1H-pyrrol-2-yl]methylene]barbituric acid 5-[[5-[2,5-bis(chloranyl)phenyl]-1H-pyrrol-2-yl]methylidene]-1,3-diazinane-2,4,6-trione SMR000290453 | cid_5769678
Type:
Small organic molecule
Emp. Form.:
C15H9Cl2N3O3
Mol. Mass.:
350.156
SMILES:
Clc1ccc(Cl)c(c1)-c1ccc(C=C2C(=O)NC(=O)NC2=O)[nH]1
: