Target
Trans-activator protein BZLF1
Ligand
BDBM47468
Substrate
Meas. Tech.
Counterscreen for inhibitors of PP1: fluorescence-based biochemical high throughput dose response assay to identify inhibitors of Protein Phosphatase 5 (PP5)
IC50
49344±n/a nM
Citation
 PubChem, PC Counterscreen for inhibitors of PP1: fluorescence-based biochemical high throughput dose response assay to identify inhibitors of Protein Phosphatase 5 (PP5) PubChem Bioassay (2010)[AID] 
Target
Name:
Trans-activator protein BZLF1
Synonyms:
BZLF1 PPP5C protein
Type:
Enzyme Catalytic Domain
Mol. Mass.:
26856.37
Organism:
Human herpesvirus 4
Description:
gi_82503229
Residue:
245
  
Inhibitor
Name:
BDBM47468
Synonyms:
MLS000769840 N-(2-phenylethyl)-2-pyridin-2-yl-quinazolin-4-amine Phenethyl-(2-pyridin-2-yl-quinazolin-4-yl)-amine cid_937982 | phenethyl-[2-(2-pyridyl)quinazolin-4-yl]amine
Type:
Small organic molecule
Emp. Form.:
C21H18N4
Mol. Mass.:
326.3944
SMILES:
C(Cc1ccccc1)Nc1nc(nc2ccccc12)-c1ccccn1
: