Target
Trans-activator protein BZLF1
Ligand
BDBM55006
Substrate
Meas. Tech.
Counterscreen for inhibitors of PP1: fluorescence-based biochemical high throughput dose response assay to identify inhibitors of Protein Phosphatase 5 (PP5)
IC50
>67047±n/a nM
Citation
 PubChem, PC Counterscreen for inhibitors of PP1: fluorescence-based biochemical high throughput dose response assay to identify inhibitors of Protein Phosphatase 5 (PP5) PubChem Bioassay (2010)[AID] 
Target
Name:
Trans-activator protein BZLF1
Synonyms:
BZLF1 PPP5C protein
Type:
Enzyme Catalytic Domain
Mol. Mass.:
26856.37
Organism:
Human herpesvirus 4
Description:
gi_82503229
Residue:
245
  
Inhibitor
Name:
BDBM55006
Synonyms:
4-[(2-cyano-1-oxoethyl)amino]benzoic acid [2-[4-[(4-ethoxyanilino)-oxomethyl]anilino]-2-oxoethyl] ester MLS001142220 [2-[4-[(4-ethoxyphenyl)carbamoyl]anilino]-2-oxoethyl] 4-[(2-cyanoacetyl)amino]benzoate cid_24981956
Type:
Small organic molecule
Emp. Form.:
C27H24N4O6
Mol. Mass.:
500.5027
SMILES:
CCOc1ccc(NC(=O)c2ccc(NC(=O)COC(=O)c3ccc(NC(=O)CC#N)cc3)cc2)cc1
: