Target
ATP-dependent molecular chaperone HSP82
Ligand
BDBM64874
Substrate
Meas. Tech.
Fluorescence Cell-Based Secondary Assay to Identify Inhibitors of Resistant C. albicans Growth in the Presence of Fluconazole
EC50
8924±1769 nM
Citation
 PubChem, PC Fluorescence Cell-Based Secondary Assay to Identify Inhibitors of Resistant C. albicans Growth in the Presence of Fluconazole PubChem Bioassay (2010)[AID] 
Target
Name:
ATP-dependent molecular chaperone HSP82
Synonyms:
heat shock protein 90
Type:
Enzyme Catalytic Domain
Mol. Mass.:
80784.12
Organism:
Candida albicans
Description:
gi_994798
Residue:
707
  
Inhibitor
Name:
BDBM64874
Synonyms:
2-amino-4-(3-pyridinyl)-4H-pyrano[3,2-h]quinoline-3-carbonitrile 2-amino-4-pyridin-3-yl-4H-pyrano[3,2-h]quinoline-3-carbonitrile 3-Amino-1-pyridin-3-yl-1H-4-oxa-5-aza-phenanthrene-2-carbonitrile SMR000014551 | cid_646013
Type:
Small organic molecule
Emp. Form.:
C18H12N4O
Mol. Mass.:
300.3141
SMILES:
N=C1Oc2c(ccc3cccnc23)C(C1C#N)c1cccnc1
: