Target
ATP-dependent molecular chaperone HSP82
Ligand
BDBM31040
Substrate
Meas. Tech.
Fluorescence Cell-Based Secondary Assay to Identify Inhibitors of Resistant C. albicans Growth in the Presence of Fluconazole
EC50
883±1157 nM
Citation
 PubChem, PC Fluorescence Cell-Based Secondary Assay to Identify Inhibitors of Resistant C. albicans Growth in the Presence of Fluconazole PubChem Bioassay (2010)[AID] 
Target
Name:
ATP-dependent molecular chaperone HSP82
Synonyms:
heat shock protein 90
Type:
Enzyme Catalytic Domain
Mol. Mass.:
80784.12
Organism:
Candida albicans
Description:
gi_994798
Residue:
707
  
Inhibitor
Name:
BDBM31040
Synonyms:
1-Ethyl-6-methyl-3-phenyl-1H-pyrimido[5,4-e][1,2,4]triazine-5,7-dione 1-ethyl-6-methyl-3-phenyl-pyrimido[5,4-e][1,2,4]triazine-5,7-quinone MLS000027832 US9073941, 602 | cid_647501
Type:
Small organic molecule
Emp. Form.:
C14H13N5O2
Mol. Mass.:
283.2853
SMILES:
CCn1nc(nc2c1nc(=O)n(C)c2=O)-c1ccccc1
: