Target
ATP-dependent molecular chaperone HSP82
Ligand
BDBM64880
Substrate
Meas. Tech.
Fluorescence Cell-Based Secondary Assay to Identify Inhibitors of Resistant C. albicans Growth in the Presence of Fluconazole
EC50
>150000±0 nM
Citation
 PubChem, PC Fluorescence Cell-Based Secondary Assay to Identify Inhibitors of Resistant C. albicans Growth in the Presence of Fluconazole PubChem Bioassay (2010)[AID] 
Target
Name:
ATP-dependent molecular chaperone HSP82
Synonyms:
heat shock protein 90
Type:
Enzyme Catalytic Domain
Mol. Mass.:
80784.12
Organism:
Candida albicans
Description:
gi_994798
Residue:
707
  
Inhibitor
Name:
BDBM64880
Synonyms:
MLS000030728 N-[4-(2-methylpiperidin-1-yl)sulfonylphenyl]-3-(1,2,3,4-tetrazol-1-yl)benzamide N-[4-(2-methylpiperidino)sulfonylphenyl]-3-(tetrazol-1-yl)benzamide SMR000002255 | cid_649307
Type:
Small organic molecule
Emp. Form.:
C20H22N6O3S
Mol. Mass.:
426.492
SMILES:
CC1CCCCN1S(=O)(=O)c1ccc(NC(=O)c2cccc(c2)-n2cnnn2)cc1
: