Target
ATP-dependent molecular chaperone HSP82
Ligand
BDBM41139
Substrate
Meas. Tech.
Fluorescence Cell-Based Secondary Assay to Identify Inhibitors of Resistant C. albicans Growth in the Presence of Fluconazole
EC50
>150000±0 nM
Citation
 PubChem, PC Fluorescence Cell-Based Secondary Assay to Identify Inhibitors of Resistant C. albicans Growth in the Presence of Fluconazole PubChem Bioassay (2010)[AID] 
Target
Name:
ATP-dependent molecular chaperone HSP82
Synonyms:
heat shock protein 90
Type:
Enzyme Catalytic Domain
Mol. Mass.:
80784.12
Organism:
Candida albicans
Description:
gi_994798
Residue:
707
  
Inhibitor
Name:
BDBM41139
Synonyms:
2-[[5-[(1S)-1-amino-2-(1H-indol-3-yl)ethyl]-1,3,4-oxadiazol-2-yl]sulfanyl]-N-(2,4-dimethylphenyl)acetamide;hydrochloride 2-[[5-[(1S)-1-azanyl-2-(1H-indol-3-yl)ethyl]-1,3,4-oxadiazol-2-yl]sulfanyl]-N-(2,4-dimethylphenyl)ethanamide;hydrochloride SMR000043041 | cid_6603605
Type:
Small organic molecule
Emp. Form.:
C22H23N5O2S
Mol. Mass.:
421.515
SMILES:
Cc1ccc(NC(=O)CSc2nnc(o2)[C@@H](N)Cc2c[nH]c3ccccc23)c(C)c1
: