Target
ATP-dependent molecular chaperone HSP82
Ligand
BDBM42674
Substrate
Meas. Tech.
Fluorescence Cell-Based Secondary Assay to Identify Inhibitors of Resistant C. albicans Growth in the Presence of Fluconazole
EC50
41671±6052 nM
Citation
 PubChem, PC Fluorescence Cell-Based Secondary Assay to Identify Inhibitors of Resistant C. albicans Growth in the Presence of Fluconazole PubChem Bioassay (2010)[AID] 
Target
Name:
ATP-dependent molecular chaperone HSP82
Synonyms:
heat shock protein 90
Type:
Enzyme Catalytic Domain
Mol. Mass.:
80784.12
Organism:
Candida albicans
Description:
gi_994798
Residue:
707
  
Inhibitor
Name:
BDBM42674
Synonyms:
MLS000058383 N-(1,3-thiazol-2-yl)-2-(3,4,5-trimethoxyphenyl)ethanamide N-thiazol-2-yl-2-(3,4,5-trimethoxyphenyl)acetamide cid_2083475
Type:
Small organic molecule
Emp. Form.:
C14H16N2O4S
Mol. Mass.:
308.353
SMILES:
COc1cc(CC(=O)Nc2nccs2)cc(OC)c1OC
: