Target
ATP-dependent molecular chaperone HSP82
Ligand
BDBM64919
Substrate
Meas. Tech.
Fluorescence Cell-Based Secondary Assay to Identify Inhibitors of Resistant C. albicans Growth in the Presence of Fluconazole
EC50
13234±2301 nM
Citation
 PubChem, PC Fluorescence Cell-Based Secondary Assay to Identify Inhibitors of Resistant C. albicans Growth in the Presence of Fluconazole PubChem Bioassay (2010)[AID] 
Target
Name:
ATP-dependent molecular chaperone HSP82
Synonyms:
heat shock protein 90
Type:
Enzyme Catalytic Domain
Mol. Mass.:
80784.12
Organism:
Candida albicans
Description:
gi_994798
Residue:
707
  
Inhibitor
Name:
BDBM64919
Synonyms:
MLS000048778 N-cyclohexyl-2-[[5-(2-furyl)-1,3,4-oxadiazol-2-yl]thio]-N-methyl-acetamide N-cyclohexyl-2-[[5-(furan-2-yl)-1,3,4-oxadiazol-2-yl]sulfanyl]-N-methylacetamide cid_2407516
Type:
Small organic molecule
Emp. Form.:
C15H19N3O3S
Mol. Mass.:
321.395
SMILES:
CN(C1CCCCC1)C(=O)CSc1nnc(o1)-c1ccco1
: