Target
ATP-dependent molecular chaperone HSP82
Ligand
BDBM64920
Substrate
Meas. Tech.
Fluorescence Cell-Based Secondary Assay to Identify Inhibitors of Resistant C. albicans Growth in the Presence of Fluconazole
EC50
3295±1701 nM
Citation
 PubChem, PC Fluorescence Cell-Based Secondary Assay to Identify Inhibitors of Resistant C. albicans Growth in the Presence of Fluconazole PubChem Bioassay (2010)[AID] 
Target
Name:
ATP-dependent molecular chaperone HSP82
Synonyms:
heat shock protein 90
Type:
Enzyme Catalytic Domain
Mol. Mass.:
80784.12
Organism:
Candida albicans
Description:
gi_994798
Residue:
707
  
Inhibitor
Name:
BDBM64920
Synonyms:
8-chloranyl-6-phenyl-1,2,4,6-tetrahydropyrazino[2,1-b]quinazolin-3-one MLS000053972 cid_2998915
Type:
Small organic molecule
Emp. Form.:
C17H14ClN3O
Mol. Mass.:
311.766
SMILES:
Clc1ccc2N=C3CNC(=O)CN3C(c3ccccc3)c2c1
: