Target
ATP-dependent molecular chaperone HSP82
Ligand
BDBM38954
Substrate
Meas. Tech.
Fluorescence Cell-Based Secondary Assay to Identify Inhibitors of Resistant C. albicans Growth in the Presence of Fluconazole
EC50
>150000±0 nM
Citation
 PubChem, PC Fluorescence Cell-Based Secondary Assay to Identify Inhibitors of Resistant C. albicans Growth in the Presence of Fluconazole PubChem Bioassay (2010)[AID] 
Target
Name:
ATP-dependent molecular chaperone HSP82
Synonyms:
heat shock protein 90
Type:
Enzyme Catalytic Domain
Mol. Mass.:
80784.12
Organism:
Candida albicans
Description:
gi_994798
Residue:
707
  
Inhibitor
Name:
BDBM38954
Synonyms:
1,2-benzothiazol-3-amine MLS000081875 cid_89966
Type:
Small organic molecule
Emp. Form.:
C7H6N2S
Mol. Mass.:
150.201
SMILES:
Nc1nsc2ccccc12
: