Target
ATP-dependent molecular chaperone HSP82
Ligand
BDBM64547
Substrate
Meas. Tech.
Fluorescence Cell-Based Secondary Assay to Identify Inhibitors of Resistant C. albicans Growth in the Presence of Fluconazole
EC50
212±1473 nM
Citation
 PubChem, PC Fluorescence Cell-Based Secondary Assay to Identify Inhibitors of Resistant C. albicans Growth in the Presence of Fluconazole PubChem Bioassay (2010)[AID] 
Target
Name:
ATP-dependent molecular chaperone HSP82
Synonyms:
heat shock protein 90
Type:
Enzyme Catalytic Domain
Mol. Mass.:
80784.12
Organism:
Candida albicans
Description:
gi_994798
Residue:
707
  
Inhibitor
Name:
BDBM64547
Synonyms:
MLS000095477 N-(2-furfuryl)-5-keto-1-thioxo-4H-thiazolo[3,4-a]quinazoline-3-carboxamide N-(furan-2-ylmethyl)-5-oxidanylidene-1-sulfanylidene-4H-[1,3]thiazolo[3,4-a]quinazoline-3-carboxamide SMR000031031 | cid_3235608
Type:
Small organic molecule
Emp. Form.:
C16H11N3O3S2
Mol. Mass.:
357.407
SMILES:
O=C(NCc1ccco1)c1sc(=S)n2c1[nH]c(=O)c1ccccc21
: