Target
ATP-dependent molecular chaperone HSP82
Ligand
BDBM40037
Substrate
Meas. Tech.
Fluorescence Cell-Based Secondary Assay to Identify Inhibitors of Resistant C. albicans Growth in the Presence of Fluconazole
EC50
17720±2546 nM
Citation
 PubChem, PC Fluorescence Cell-Based Secondary Assay to Identify Inhibitors of Resistant C. albicans Growth in the Presence of Fluconazole PubChem Bioassay (2010)[AID] 
Target
Name:
ATP-dependent molecular chaperone HSP82
Synonyms:
heat shock protein 90
Type:
Enzyme Catalytic Domain
Mol. Mass.:
80784.12
Organism:
Candida albicans
Description:
gi_994798
Residue:
707
  
Inhibitor
Name:
BDBM40037
Synonyms:
(3aS,4R,9bR)-4-(2-pyridinyl)-3a,4,5,9b-tetrahydro-3H-cyclopenta[c]quinoline-8-carboxylic acid (3aS,4R,9bR)-4-pyridin-2-yl-3a,4,5,9b-tetrahydro-3H-cyclopenta[c]quinoline-8-carboxylic acid MLS000085196 cid_1203912
Type:
Small organic molecule
Emp. Form.:
C18H16N2O2
Mol. Mass.:
292.3318
SMILES:
OC(=O)c1ccc2N[C@H]([C@H]3CC=C[C@H]3c2c1)c1ccccn1
: