Target
Streptokinase A
Ligand
BDBM54883
Substrate
Meas. Tech.
Absorbance Microorganism-Based Dose Response Followup to Identify Inhibitors of Streptokinase Expression.
EC50
4025±1152 nM
Citation
 PubChem, PC Absorbance Microorganism-Based Dose Response Followup to Identify Inhibitors of Streptokinase Expression. PubChem Bioassay (2010)[AID] 
Target
Name:
Streptokinase A
Synonyms:
STRP_STRP1 streptokinase A precursor
Type:
Enzyme Catalytic Domain
Mol. Mass.:
49924.80
Organism:
Streptococcus pyogenes M1 GAS
Description:
gi_15675770
Residue:
440
  
Inhibitor
Name:
BDBM54883
Synonyms:
4-methoxy-2-(4-propoxyphenyl)quinazoline MLS002699829, ML134 | cid_1612038
Type:
Small organic molecule
Emp. Form.:
C18H18N2O2
Mol. Mass.:
294.3477
SMILES:
CCCOc1ccc(cc1)-c1nc(OC)c2ccccc2n1
: