Target
Streptokinase A
Ligand
BDBM65740
Substrate
Meas. Tech.
Absorbance Microorganism-Based Dose Response Followup to Identify Inhibitors of Streptokinase Expression.
EC50
71623±1425 nM
Citation
 PubChem, PC Absorbance Microorganism-Based Dose Response Followup to Identify Inhibitors of Streptokinase Expression. PubChem Bioassay (2010)[AID] 
Target
Name:
Streptokinase A
Synonyms:
STRP_STRP1 streptokinase A precursor
Type:
Enzyme Catalytic Domain
Mol. Mass.:
49924.80
Organism:
Streptococcus pyogenes M1 GAS
Description:
gi_15675770
Residue:
440
  
Inhibitor
Name:
BDBM65740
Synonyms:
4-phenoxy-2-(4-propoxyphenyl)quinazoline cid_1597037
Type:
Small organic molecule
Emp. Form.:
C23H20N2O2
Mol. Mass.:
356.4171
SMILES:
CCCOc1ccc(cc1)-c1nc(Oc2ccccc2)c2ccccc2n1
: