Target
Nucleotide-binding oligomerization domain-containing protein 2
Ligand
BDBM65728
Substrate
Meas. Tech.
SAR analysis of compounds that inhibit NOD2 - Set 2
IC50
>20000±n/a nM
Citation
 PubChem, PC SAR analysis of compounds that inhibit NOD2 - Set 2 PubChem Bioassay (2010)[AID] 
Target
Name:
Nucleotide-binding oligomerization domain-containing protein 2
Synonyms:
CARD15 IBD1 NOD2 Nucleotide-binding oligomerization domain-containing protein 2 | nucleotide-binding oligomerization domain containing 2
Type:
PROTEIN
Mol. Mass.:
115287.18
Organism:
Homo sapiens (Human)
Description:
ChEMBL_1454053
Residue:
1040
  
Inhibitor
Name:
BDBM65728
Synonyms:
7-[(E)-but-2-enyl]-3-methyl-8-(phenylmethylsulfanyl)purine-2,6-dione 8-(benzylthio)-7-[(E)-but-2-enyl]-3-methyl-xanthine MLS-0013615.0001 | cid_5761203
Type:
Small organic molecule
Emp. Form.:
C17H18N4O2S
Mol. Mass.:
342.415
SMILES:
C\C=C\Cn1c(SCc2ccccc2)nc2n(C)c(=O)[nH]c(=O)c12
: