Target
Nucleotide-binding oligomerization domain-containing protein 2
Ligand
BDBM65732
Substrate
Meas. Tech.
SAR analysis of compounds that inhibit NOD2 - Set 2
IC50
>20000±n/a nM
Citation
 PubChem, PC SAR analysis of compounds that inhibit NOD2 - Set 2 PubChem Bioassay (2010)[AID] 
Target
Name:
Nucleotide-binding oligomerization domain-containing protein 2
Synonyms:
CARD15 IBD1 NOD2 Nucleotide-binding oligomerization domain-containing protein 2 | nucleotide-binding oligomerization domain containing 2
Type:
PROTEIN
Mol. Mass.:
115287.18
Organism:
Homo sapiens (Human)
Description:
ChEMBL_1454053
Residue:
1040
  
Inhibitor
Name:
BDBM65732
Synonyms:
7-(2-methoxyethyl)-3-methyl-8-(3-phenylpropylsulfanyl)purine-2,6-dione 7-(2-methoxyethyl)-3-methyl-8-(3-phenylpropylthio)xanthine cid_652751
Type:
Small organic molecule
Emp. Form.:
C18H22N4O3S
Mol. Mass.:
374.457
SMILES:
COCCn1c(SCCCc2ccccc2)nc2n(C)c(=O)[nH]c(=O)c12
: