Target
Nucleotide-binding oligomerization domain-containing protein 2
Ligand
BDBM50760
Substrate
Meas. Tech.
SAR analysis of compounds that inhibit NOD2 - Set 2
IC50
>20000±n/a nM
Citation
 PubChem, PC SAR analysis of compounds that inhibit NOD2 - Set 2 PubChem Bioassay (2010)[AID] 
Target
Name:
Nucleotide-binding oligomerization domain-containing protein 2
Synonyms:
CARD15 IBD1 NOD2 Nucleotide-binding oligomerization domain-containing protein 2 | nucleotide-binding oligomerization domain containing 2
Type:
PROTEIN
Mol. Mass.:
115287.18
Organism:
Homo sapiens (Human)
Description:
ChEMBL_1454053
Residue:
1040
  
Inhibitor
Name:
BDBM50760
Synonyms:
3-Methyl-8-phenethylsulfanyl-7-propyl-3,7-dihydro-purine-2,6-dione 3-methyl-8-(2-phenylethylsulfanyl)-7-propylpurine-2,6-dione 3-methyl-8-(phenethylthio)-7-propyl-xanthine SMR000009144 | cid_650170
Type:
Small organic molecule
Emp. Form.:
C17H20N4O2S
Mol. Mass.:
344.431
SMILES:
CCCn1c(SCCc2ccccc2)nc2n(C)c(=O)[nH]c(=O)c12
: