Target
Nucleotide-binding oligomerization domain-containing protein 1
Ligand
BDBM61153
Substrate
Meas. Tech.
SAR analysis of Antagonists of the GPR35 Receptor using an Image-Based Assay - Set 2
IC50
240±n/a nM
Citation
 PubChem, PC SAR analysis of Antagonists of the GPR35 Receptor using an Image-Based Assay - Set 2 PubChem Bioassay (2010)[AID] 
Target
Name:
Nucleotide-binding oligomerization domain-containing protein 1
Synonyms:
CARD4 NOD1_HUMAN | nucleotide-binding oligomerization domain containing 1
Type:
Enzyme Catalytic Domain
Mol. Mass.:
107699.03
Organism:
Homo sapiens (Human)
Description:
gi_5174617
Residue:
953
  
Inhibitor
Name:
BDBM61153
Synonyms:
3-[4-[(5Z)-4-keto-5-(4-methylbenzylidene)-2-thioxo-thiazolidin-3-yl]butanoylamino]benzoic acid 3-[4-[(5Z)-5-[(4-methylphenyl)methylidene]-4-oxo-2-sulfanylidene-1,3-thiazolidin-3-yl]butanoylamino]benzoic acid MLS001034563 cid_1346721
Type:
Small organic molecule
Emp. Form.:
C22H20N2O4S2
Mol. Mass.:
440.535
SMILES:
Cc1ccc(\C=C2/SC(=S)N(CCCC(=O)Nc3cccc(c3)C(O)=O)C2=O)cc1
: