Target
Nucleotide-binding oligomerization domain-containing protein 1
Ligand
BDBM64816
Substrate
Meas. Tech.
SAR analysis of Antagonists of the GPR35 Receptor using an Image-Based Assay - Set 2
IC50
12500±n/a nM
Citation
 PubChem, PC SAR analysis of Antagonists of the GPR35 Receptor using an Image-Based Assay - Set 2 PubChem Bioassay (2010)[AID] 
Target
Name:
Nucleotide-binding oligomerization domain-containing protein 1
Synonyms:
CARD4 NOD1_HUMAN | nucleotide-binding oligomerization domain containing 1
Type:
Enzyme Catalytic Domain
Mol. Mass.:
107699.03
Organism:
Homo sapiens (Human)
Description:
gi_5174617
Residue:
953
  
Inhibitor
Name:
BDBM64816
Synonyms:
4-[[2-[2-(4-ethoxyanilino)-2-oxoethyl]sulfanyl-4-oxothieno[3,2-d]pyrimidin-3-yl]methyl]benzoic acid 4-[[2-[[2-(4-ethoxyanilino)-2-oxoethyl]thio]-4-oxo-3-thieno[3,2-d]pyrimidinyl]methyl]benzoic acid MLS-0435426.0001 | cid_4362054
Type:
Small organic molecule
Emp. Form.:
C24H21N3O5S2
Mol. Mass.:
495.571
SMILES:
CCOc1ccc(NC(=O)CSc2nc3ccsc3c(=O)n2Cc2ccc(cc2)C(O)=O)cc1
: