Target
Nucleotide-binding oligomerization domain-containing protein 1
Ligand
BDBM64821
Substrate
Meas. Tech.
SAR analysis of Antagonists of the GPR35 Receptor using an Image-Based Assay - Set 2
IC50
6100±n/a nM
Citation
 PubChem, PC SAR analysis of Antagonists of the GPR35 Receptor using an Image-Based Assay - Set 2 PubChem Bioassay (2010)[AID] 
Target
Name:
Nucleotide-binding oligomerization domain-containing protein 1
Synonyms:
CARD4 NOD1_HUMAN | nucleotide-binding oligomerization domain containing 1
Type:
Enzyme Catalytic Domain
Mol. Mass.:
107699.03
Organism:
Homo sapiens (Human)
Description:
gi_5174617
Residue:
953
  
Inhibitor
Name:
BDBM64821
Synonyms:
MLS-0244945.0001 N-(3-fluoro-4-methyl-phenyl)-2,5-dimethyl-4-(4-methylpiperidino)thieno[2,3-d]pyrimidine-6-carboxamide N-(3-fluoro-4-methylphenyl)-2,5-dimethyl-4-(4-methylpiperidin-1-yl)thieno[2,3-d]pyrimidine-6-carboxamide | cid_4137223
Type:
Small organic molecule
Emp. Form.:
C22H25FN4OS
Mol. Mass.:
412.524
SMILES:
CC1CCN(CC1)c1nc(C)nc2sc(C(=O)Nc3ccc(C)c(F)c3)c(C)c12
: