Target
Nucleotide-binding oligomerization domain-containing protein 1
Ligand
BDBM57757
Substrate
Meas. Tech.
SAR analysis of Antagonists of the GPR35 Receptor using an Image-Based Assay - Set 2
IC50
10200±n/a nM
Citation
 PubChem, PC SAR analysis of Antagonists of the GPR35 Receptor using an Image-Based Assay - Set 2 PubChem Bioassay (2010)[AID] 
Target
Name:
Nucleotide-binding oligomerization domain-containing protein 1
Synonyms:
CARD4 NOD1_HUMAN | nucleotide-binding oligomerization domain containing 1
Type:
Enzyme Catalytic Domain
Mol. Mass.:
107699.03
Organism:
Homo sapiens (Human)
Description:
gi_5174617
Residue:
953
  
Inhibitor
Name:
BDBM57757
Synonyms:
2,5-dimethyl-4-(4-methyl-1-piperidinyl)-N-[2-(trifluoromethyl)phenyl]-6-thieno[2,3-d]pyrimidinecarboxamide 2,5-dimethyl-4-(4-methylpiperidino)-N-[2-(trifluoromethyl)phenyl]thieno[2,3-d]pyrimidine-6-carboxamide SMR000312025 | cid_4137233
Type:
Small organic molecule
Emp. Form.:
C22H23F3N4OS
Mol. Mass.:
448.504
SMILES:
CC1CCN(CC1)c1nc(C)nc2sc(C(=O)Nc3ccccc3C(F)(F)F)c(C)c12
: