Target
Nucleotide-binding oligomerization domain-containing protein 1
Ligand
BDBM61652
Substrate
Meas. Tech.
SAR analysis of Antagonists of the GPR35 Receptor using an Image-Based Assay - Set 2
IC50
295±n/a nM
Citation
 PubChem, PC SAR analysis of Antagonists of the GPR35 Receptor using an Image-Based Assay - Set 2 PubChem Bioassay (2010)[AID] 
Target
Name:
Nucleotide-binding oligomerization domain-containing protein 1
Synonyms:
CARD4 NOD1_HUMAN | nucleotide-binding oligomerization domain containing 1
Type:
Enzyme Catalytic Domain
Mol. Mass.:
107699.03
Organism:
Homo sapiens (Human)
Description:
gi_5174617
Residue:
953
  
Inhibitor
Name:
BDBM61652
Synonyms:
2-hydroxy-4-[[1-oxo-4-[(5Z)-4-oxo-5-(phenylmethylene)-2-sulfanylidene-3-thiazolidinyl]butyl]amino]benzoic acid 4-[4-[(5Z)-5-benzal-4-keto-2-thioxo-thiazolidin-3-yl]butanoylamino]-2-hydroxy-benzoic acid MLS001157852 cid_6226024
Type:
Small organic molecule
Emp. Form.:
C21H18N2O5S2
Mol. Mass.:
442.508
SMILES:
OC(=O)c1ccc(NC(=O)CCCN2C(=S)S\C(=C/c3ccccc3)C2=O)cc1O
: