Target
Nucleotide-binding oligomerization domain-containing protein 1
Ligand
BDBM64825
Substrate
Meas. Tech.
SAR analysis of Antagonists of the GPR35 Receptor using an Image-Based Assay - Set 2
IC50
>32000±n/a nM
Citation
 PubChem, PC SAR analysis of Antagonists of the GPR35 Receptor using an Image-Based Assay - Set 2 PubChem Bioassay (2010)[AID] 
Target
Name:
Nucleotide-binding oligomerization domain-containing protein 1
Synonyms:
CARD4 NOD1_HUMAN | nucleotide-binding oligomerization domain containing 1
Type:
Enzyme Catalytic Domain
Mol. Mass.:
107699.03
Organism:
Homo sapiens (Human)
Description:
gi_5174617
Residue:
953
  
Inhibitor
Name:
BDBM64825
Synonyms:
1-(2-chlorobenzyl)-4-(4-phenylpiperazino)pyrazolo[3,4-d]pyrimidine 1-[(2-chlorophenyl)methyl]-4-(4-phenylpiperazin-1-yl)pyrazolo[3,4-d]pyrimidine cid_8037844
Type:
Small organic molecule
Emp. Form.:
C22H21ClN6
Mol. Mass.:
404.895
SMILES:
Clc1ccccc1Cn1ncc2c(ncnc12)N1CCN(CC1)c1ccccc1
: