Target
Nucleotide-binding oligomerization domain-containing protein 1
Ligand
BDBM61651
Substrate
Meas. Tech.
SAR analysis of Antagonists of the GPR35 Receptor using an Image-Based Assay - Set 2
IC50
2230±n/a nM
Citation
 PubChem, PC SAR analysis of Antagonists of the GPR35 Receptor using an Image-Based Assay - Set 2 PubChem Bioassay (2010)[AID] 
Target
Name:
Nucleotide-binding oligomerization domain-containing protein 1
Synonyms:
CARD4 NOD1_HUMAN | nucleotide-binding oligomerization domain containing 1
Type:
Enzyme Catalytic Domain
Mol. Mass.:
107699.03
Organism:
Homo sapiens (Human)
Description:
gi_5174617
Residue:
953
  
Inhibitor
Name:
BDBM61651
Synonyms:
3-(4-tert-butylphenoxy)-N-[2-(4-sulfamoylphenyl)ethyl]propanamide MLS001151090 cid_18158890
Type:
Small organic molecule
Emp. Form.:
C21H28N2O4S
Mol. Mass.:
404.523
SMILES:
CC(C)(C)c1ccc(OCCC(=O)NCCc2ccc(cc2)S(N)(=O)=O)cc1
: