Target
Tumor necrosis factor
Ligand
BDBM54304
Substrate
Meas. Tech.
SAR analysis of inhibitors of TNFa specific NF-kB induction - Set 2
IC50
>20000±n/a nM
Citation
 PubChem, PC SAR analysis of inhibitors of TNFa specific NF-kB induction - Set 2 PubChem Bioassay (2010)[AID] 
Target
Name:
Tumor necrosis factor
Synonyms:
Cachectin TNF-a TNFA TNFSF2 Tumor necrosis factor (TNFa) Tumor necrosis factor ligand superfamily member 2 Tumor necrosis factor, soluble form | tumor necrosis factor alpha
Type:
Enzyme
Mol. Mass.:
25645.11
Organism:
Homo sapiens (Human)
Description:
P01375
Residue:
233
  
Inhibitor
Name:
BDBM54304
Synonyms:
2-[(4-bromo-2,5-dimethyl-phenyl)thio]acetic acid [3-cyano-3-(1,3-dihydrobenzimidazol-2-ylidene)-2-keto-propyl] ester MLS000374952 [3-cyano-3-(1,3-dihydrobenzimidazol-2-ylidene)-2-oxidanylidene-propyl] 2-(4-bromanyl-2,5-dimethyl-phenyl)sulfanylethanoate cid_5679921
Type:
Small organic molecule
Emp. Form.:
C21H18BrN3O3S
Mol. Mass.:
472.355
SMILES:
Cc1cc(SCC(=O)OCC(=O)C(C#N)c2nc3ccccc3[nH]2)c(C)cc1Br
: