Target
Tumor necrosis factor
Ligand
BDBM65728
Substrate
Meas. Tech.
SAR analysis of inhibitors of TNFa specific NF-kB induction - Set 2
IC50
>20000±n/a nM
Citation
 PubChem, PC SAR analysis of inhibitors of TNFa specific NF-kB induction - Set 2 PubChem Bioassay (2010)[AID] 
Target
Name:
Tumor necrosis factor
Synonyms:
Cachectin TNF-a TNFA TNFSF2 Tumor necrosis factor (TNFa) Tumor necrosis factor ligand superfamily member 2 Tumor necrosis factor, soluble form | tumor necrosis factor alpha
Type:
Enzyme
Mol. Mass.:
25645.11
Organism:
Homo sapiens (Human)
Description:
P01375
Residue:
233
  
Inhibitor
Name:
BDBM65728
Synonyms:
7-[(E)-but-2-enyl]-3-methyl-8-(phenylmethylsulfanyl)purine-2,6-dione 8-(benzylthio)-7-[(E)-but-2-enyl]-3-methyl-xanthine MLS-0013615.0001 | cid_5761203
Type:
Small organic molecule
Emp. Form.:
C17H18N4O2S
Mol. Mass.:
342.415
SMILES:
C\C=C\Cn1c(SCc2ccccc2)nc2n(C)c(=O)[nH]c(=O)c12
: